Regression_Test >> Sandbox >> TBWikiDocumentation >> TBWikiToDo >> Wiki_Status_Page 

TB Wiki

Login

TBWIKI Error

exception in macro SiteStatus:main
Traceback (most recent call last):
  File "/home2/birdorg/work/tbwiki-data/tbwiki/plugins/MacroSiteStatus.py", line 49, in main
    http_code = urlopen(site, timeout=3).getcode()
  File "/usr/lib64/python3.9/urllib/request.py", line 214, in urlopen
    return opener.open(url, data, timeout)
  File "/usr/lib64/python3.9/urllib/request.py", line 523, in open
    response = meth(req, response)
  File "/usr/lib64/python3.9/urllib/request.py", line 632, in http_response
    response = self.parent.error(
  File "/usr/lib64/python3.9/urllib/request.py", line 561, in error
    return self._call_chain(*args)
  File "/usr/lib64/python3.9/urllib/request.py", line 494, in _call_chain
    result = func(*args)
  File "/usr/lib64/python3.9/urllib/request.py", line 641, in http_error_default
    raise HTTPError(req.full_url, code, msg, hdrs, fp)
urllib.error.HTTPError: HTTP Error 406: Not Acceptable

During handling of the above exception, another exception occurred:

Traceback (most recent call last):
  File "/home2/birdorg/work/tbwiki/cgi-bin/tbwiki_engine.py", line 2047, in call_macro
    html = main_func(req, args)
  File "/home2/birdorg/work/tbwiki-data/tbwiki/plugins/MacroSiteStatus.py", line 79, in main
    return req.html_error("Exception getting site status (for '%s'): %s" % (site, str(e)), False)
TypeError: html_error() takes 1 positional argument but 2 were given


exception in macro SiteStatus:main
Traceback (most recent call last):
  File "/home2/birdorg/work/tbwiki-data/tbwiki/plugins/MacroSiteStatus.py", line 49, in main
    http_code = urlopen(site, timeout=3).getcode()
  File "/usr/lib64/python3.9/urllib/request.py", line 214, in urlopen
    return opener.open(url, data, timeout)
  File "/usr/lib64/python3.9/urllib/request.py", line 523, in open
    response = meth(req, response)
  File "/usr/lib64/python3.9/urllib/request.py", line 632, in http_response
    response = self.parent.error(
  File "/usr/lib64/python3.9/urllib/request.py", line 561, in error
    return self._call_chain(*args)
  File "/usr/lib64/python3.9/urllib/request.py", line 494, in _call_chain
    result = func(*args)
  File "/usr/lib64/python3.9/urllib/request.py", line 641, in http_error_default
    raise HTTPError(req.full_url, code, msg, hdrs, fp)
urllib.error.HTTPError: HTTP Error 406: Not Acceptable

During handling of the above exception, another exception occurred:

Traceback (most recent call last):
  File "/home2/birdorg/work/tbwiki/cgi-bin/tbwiki_engine.py", line 2047, in call_macro
    html = main_func(req, args)
  File "/home2/birdorg/work/tbwiki-data/tbwiki/plugins/MacroSiteStatus.py", line 79, in main
    return req.html_error("Exception getting site status (for '%s'): %s" % (site, str(e)), False)
TypeError: html_error() takes 1 positional argument but 2 were given


exception in macro SiteStatus:main
Traceback (most recent call last):
  File "/home2/birdorg/work/tbwiki-data/tbwiki/plugins/MacroSiteStatus.py", line 49, in main
    http_code = urlopen(site, timeout=3).getcode()
  File "/usr/lib64/python3.9/urllib/request.py", line 214, in urlopen
    return opener.open(url, data, timeout)
  File "/usr/lib64/python3.9/urllib/request.py", line 523, in open
    response = meth(req, response)
  File "/usr/lib64/python3.9/urllib/request.py", line 632, in http_response
    response = self.parent.error(
  File "/usr/lib64/python3.9/urllib/request.py", line 561, in error
    return self._call_chain(*args)
  File "/usr/lib64/python3.9/urllib/request.py", line 494, in _call_chain
    result = func(*args)
  File "/usr/lib64/python3.9/urllib/request.py", line 641, in http_error_default
    raise HTTPError(req.full_url, code, msg, hdrs, fp)
urllib.error.HTTPError: HTTP Error 406: Not Acceptable

During handling of the above exception, another exception occurred:

Traceback (most recent call last):
  File "/home2/birdorg/work/tbwiki/cgi-bin/tbwiki_engine.py", line 2047, in call_macro
    html = main_func(req, args)
  File "/home2/birdorg/work/tbwiki-data/tbwiki/plugins/MacroSiteStatus.py", line 79, in main
    return req.html_error("Exception getting site status (for '%s'): %s" % (site, str(e)), False)
TypeError: html_error() takes 1 positional argument but 2 were given


Exception raised by tbwiki software
Traceback (most recent call last):
  File "/home2/birdorg/public_html/cgi-bin/tbwiki.cgi", line 55, in 
    main(req)
  File "/home2/birdorg/work/tbwiki/cgi-bin/tbwiki_engine.py", line 2791, in main
    html = re.sub(highlight, new_str, html)
  File "/usr/lib64/python3.9/re.py", line 210, in sub
    return _compile(pattern, flags).sub(repl, string, count)
  File "/usr/lib64/python3.9/re.py", line 304, in _compile
    p = sre_compile.compile(pattern, flags)
  File "/usr/lib64/python3.9/sre_compile.py", line 788, in compile
    p = sre_parse.parse(p, flags)
  File "/usr/lib64/python3.9/sre_parse.py", line 955, in parse
    p = _parse_sub(source, state, flags & SRE_FLAG_VERBOSE, 0)
  File "/usr/lib64/python3.9/sre_parse.py", line 444, in _parse_sub
    itemsappend(_parse(source, state, verbose, nested + 1,
  File "/usr/lib64/python3.9/sre_parse.py", line 843, in _parse
    raise source.error("missing ), unterminated subpattern",
re.error: missing ), unterminated subpattern at position 21